Uploaded image for project: 'openATTIC'
  1. openATTIC
  2. OP-3194

oA frontend unit test failure in storage-ci Jenkins job

    XMLWordPrintable

    Details

    • Type: Bug
    • Status: Resolved
    • Priority: Major
    • Resolution: Fixed
    • Affects Version/s: 3.7.2, 3.7.3
    • Fix Version/s: 3.7.3
    • Component/s: QA/Testing
    • Labels:

      Description

      17:44:47 HeadlessChrome 72.0.3626 (Linux 0.0.0) task-queue-modal timeBetween test calc approx FAILED
      17:44:47 	Expected '2020-02-29T02:32:30.265Z' to be '2020-02-29T01:32:30.265Z'.
      17:44:47 	    at forEach (app/test.js:92173:64)
      17:44:47 	    at Array.forEach (<anonymous>)
      17:44:47 	    at UserContext.it (app/test.js:92168:9)
      17:44:47 	Expected '2020-02-20T20:21:10.265Z' to be '2020-02-20T19:21:10.265Z'.
      17:44:47 	    at forEach (app/test.js:92173:64)
      17:44:47 	    at Array.forEach (<anonymous>)
      17:44:47 	    at UserContext.it (app/test.js:92168:9)
      17:44:47 HeadlessChrome 72.0.3626 (Linux 0.0.0): Executed 62 of 78 (1 FAILED) (0 secs / 0 secs)
      17:44:47 HeadlessChrome 72.0.3626 (Linux 0.0.0) task-queue-modal timeBetween test calc approx FAILED
      17:44:47 	Expected '2020-02-29T02:32:30.265Z' to be '2020-02-29T01:32:30.265Z'.
      17:44:47 	    at forEach (app/test.js:92173:64)
      17:44:47 	    at Array.forEach (<anonymous>)
      17:44:47 	    at UserContext.it (app/test.js:92168:9)
      17:44:47 	Expected '2020-02-20T20:21:10.265Z' to be '2020-02-20T19:21:10.265Z'.
      17:44:47 	    at forEach (app/test.js:92173:64)
      17:44:47 	    at Array.forEach (<anonymous>)
      17:44:47 	    at UserContext.it (app/test.js:92168:9)
      17:44:47 HeadlessChrome 72.0.3626 (Linux 0.0.0): Executed 63 of 78 (1 FAILED) (0 secs / 0 secs)
      17:44:48 HeadlessChrome 72.0.3626 (Linux 0.0.0): Executed 64 of 78 (1 FAILED) (0 secs / 0 secs)
      17:44:48 HeadlessChrome 72.0.3626 (Linux 0.0.0): Executed 65 of 78 (1 FAILED) (0 secs / 0 secs)
      17:44:48 HeadlessChrome 72.0.3626 (Linux 0.0.0): Executed 66 of 78 (1 FAILED) (0 secs / 0 secs)
      17:44:48 HeadlessChrome 72.0.3626 (Linux 0.0.0): Executed 67 of 78 (1 FAILED) (0 secs / 0 secs)
      17:44:48 HeadlessChrome 72.0.3626 (Linux 0.0.0): Executed 68 of 78 (1 FAILED) (0 secs / 0 secs)
      17:44:48 HeadlessChrome 72.0.3626 (Linux 0.0.0): Executed 69 of 78 (1 FAILED) (0 secs / 0 secs)
      17:44:48 HeadlessChrome 72.0.3626 (Linux 0.0.0): Executed 70 of 78 (1 FAILED) (0 secs / 0 secs)
      17:44:48 HeadlessChrome 72.0.3626 (Linux 0.0.0): Executed 71 of 78 (1 FAILED) (0 secs / 0 secs)
      17:44:48 HeadlessChrome 72.0.3626 (Linux 0.0.0): Executed 72 of 78 (1 FAILED) (0 secs / 0 secs)
      17:44:48 HeadlessChrome 72.0.3626 (Linux 0.0.0): Executed 73 of 78 (1 FAILED) (0 secs / 0 secs)
      17:44:48 HeadlessChrome 72.0.3626 (Linux 0.0.0): Executed 74 of 78 (1 FAILED) (0 secs / 0 secs)
      17:44:48 HeadlessChrome 72.0.3626 (Linux 0.0.0): Executed 75 of 78 (1 FAILED) (0 secs / 0 secs)
      17:44:48 HeadlessChrome 72.0.3626 (Linux 0.0.0): Executed 76 of 78 (1 FAILED) (0 secs / 0 secs)
      17:44:48 HeadlessChrome 72.0.3626 (Linux 0.0.0): Executed 77 of 78 (1 FAILED) (0 secs / 0 secs)
      17:44:48 HeadlessChrome 72.0.3626 (Linux 0.0.0): Executed 78 of 78 (1 FAILED) (0 secs / 0 secs)
      17:44:48 HeadlessChrome 72.0.3626 (Linux 0.0.0): Executed 78 of 78 (1 FAILED) (3.822 secs / 0 secs)
      

      (see build #27 of the storage-ci-test-testing-5.0 Jenkins job)

        Attachments

          Activity

            People

            Assignee:
            sgmueller Stephan Müller
            Reporter:
            lpaduano Paduano, Laura
            Votes:
            0 Vote for this issue
            Watchers:
            1 Start watching this issue

              Dates

              Created:
              Updated:
              Resolved: